exchange-n
type: LexicalEntry
canonical form: exchange
sense: 01095009-n
part of speech: noun

interchange-n
type: LexicalEntry
canonical form: interchange
sense: 01095009-n
part of speech: noun

01095009-n
type: LexicalConcept
in scheme: en-word.net
definition: reciprocal transfer of equivalent sums of money (especially the currencies of different countries)
example: he earns his living from the interchange of currency
ili: i41130
lexfile: noun.act
part of speech: noun
hypernym: 01092370-n