referee-v
type: LexicalEntry
canonical form: referee
sense: 01087648-v
part of speech: verb

umpire-v
type: LexicalEntry
canonical form: umpire
sense: 01087648-v
part of speech: verb

01087648-v
type: LexicalConcept
in scheme: en-word.net
definition: be a referee or umpire in a sports competition
ili: i27019
lexfile: verb.competition
part of speech: verb
domain topic: 00524569-n
hypernym: 00674196-v