affiliation-n
type: LexicalEntry
canonical form: affiliation
sense: 01083985-n
part of speech: noun

01083985-n
type: LexicalConcept
in scheme: en-word.net
definition: the act of becoming formally connected or joined
example: welcomed the affiliation of the research center with the university
ili: i41076
lexfile: noun.act
part of speech: noun
hypernym: 01083552-n