promote-v
type: LexicalEntry
canonical form: promote
sense: 01082916-v
part of speech: verb

01082916-v
type: LexicalConcept
in scheme: en-word.net
definition: be changed for a superior chess or checker piece
ili: i26992
lexfile: verb.competition
part of speech: verb
domain topic: 00503426-n
hypernym: 00109468-v
similar: 01082628-v