enjoyment-n
type: LexicalEntry
canonical form: enjoyment
sense: 01073996-n
part of speech: noun

delectation-n
type: LexicalEntry
canonical form: delectation
sense: 01073996-n
part of speech: noun

01073996-n
type: LexicalConcept
in scheme: en-word.net
definition: act of receiving pleasure from something
ili: i41032
lexfile: noun.act
part of speech: noun
hypernym: 00408356-n