communicate-v
type: LexicalEntry
canonical form: communicate
sense: 01072124-v
part of speech: verb

01072124-v
type: LexicalConcept
in scheme: en-word.net
definition: be in verbal contact; interchange information or ideas
example: He and his sons haven't communicated for years
example: Do you communicate well with your advisor?
ili: i26940
lexfile: verb.communication
part of speech: verb
hypernym: 02382049-v