write up-v
type: LexicalEntry
canonical form: write up
sense: 01070156-v
part of speech: verb

01070156-v
type: LexicalConcept
in scheme: en-word.net
definition: bring to public notice by writing, with praise or condemnation
example: The New York Times wrote him up last week
example: Did your boss write you up?
ili: i26929
lexfile: verb.communication
part of speech: verb
hypernym: 00995046-v