menace-v
type: LexicalEntry
canonical form: menace
sense: 01069216-v
part of speech: verb

01069216-v
type: LexicalConcept
in scheme: en-word.net
definition: express a threat either by an utterance or a gesture
example: he menaced the bank manager with a stick
ili: i26923
lexfile: verb.communication
part of speech: verb
hypernym: 00945869-v