get-v
type: LexicalEntry
canonical form: get
sense: 01068058-v
part of speech: verb

01068058-v
type: LexicalConcept
in scheme: en-word.net
definition: communicate with a place or person; establish communication with, as if by telephone
example: Bill called this number and he got Mary
example: The operator couldn't get Kobe because of the earthquake
ili: i26918
lexfile: verb.communication
part of speech: verb
hypernym: 00742582-v