vegetation-n
type: LexicalEntry
canonical form: vegetation
sense: 01066981-n
part of speech: noun

01066981-n
type: LexicalConcept
in scheme: en-word.net
definition: inactivity that is passive and monotonous, comparable to the inactivity of plant life
example: their holiday was spent in sleep and vegetation
ili: i40992
lexfile: noun.act
part of speech: noun
hypernym: 01066787-n