express-v
type: LexicalEntry
canonical form: express
sense: 01063503-v
part of speech: verb

state-v
type: LexicalEntry
canonical form: state
sense: 01063503-v
part of speech: verb

01063503-v
type: LexicalConcept
in scheme: en-word.net
definition: indicate through a symbol, formula, etc.
example: Can you express this distance in kilometers?
ili: i26891
lexfile: verb.communication
part of speech: verb
hypernym: 00933429-v