jam-v
type: LexicalEntry
canonical form: jam
sense: 01058906-v
part of speech: verb

block-v
type: LexicalEntry
canonical form: block
sense: 01058906-v
part of speech: verb

01058906-v
type: LexicalConcept
in scheme: en-word.net
definition: interfere with or prevent the reception of signals
example: Jam the Voice of America
example: block the signals emitted by this station
ili: i26868
lexfile: verb.communication
part of speech: verb
hypernym: 00780320-v