snort-v
type: LexicalEntry
canonical form: snort
sense: 01046945-v
part of speech: verb

01046945-v
type: LexicalConcept
in scheme: en-word.net
definition: indicate contempt by breathing noisily and forcefully through the nose
example: she snorted her disapproval of the proposed bridegroom
ili: i26797
lexfile: verb.communication
part of speech: verb
hypernym: 00985856-v