blessing-n
type: LexicalEntry
canonical form: blessing
sense: 01045725-n
part of speech: noun

benediction-n
type: LexicalEntry
canonical form: benediction
sense: 01045725-n
part of speech: noun

01045725-n
type: LexicalConcept
in scheme: en-word.net
definition: the act of praying for divine protection
ili: i40870
lexfile: noun.act
part of speech: noun
hypernym: 01044000-n