quotation-n
type: LexicalEntry
canonical form: quotation
sense: 01032674-n
part of speech: noun

01032674-n
type: LexicalConcept
in scheme: en-word.net
definition: the practice of quoting from books or plays etc.
example: since he lacks originality he must rely on quotation
ili: i40800
lexfile: noun.act
part of speech: noun
hypernym: 00411260-n