rite-n
type: LexicalEntry
canonical form: rite
sense: 01031438-n
part of speech: noun

religious rite-n
type: LexicalEntry
canonical form: religious rite
sense: 01031438-n
part of speech: noun

01031438-n
type: LexicalConcept
in scheme: en-word.net
definition: an established ceremony prescribed by a religion
example: the rite of baptism
ili: i40793
lexfile: noun.act
part of speech: noun
hypernym: 01030024-n