pursuance-n
type: LexicalEntry
canonical form: pursuance
sense: 01023950-n
part of speech: noun

prosecution-n
type: LexicalEntry
canonical form: prosecution
sense: 01023950-n
part of speech: noun

01023950-n
type: LexicalConcept
in scheme: en-word.net
definition: the continuance of something begun with a view to its completion
ili: i40757
lexfile: noun.act
part of speech: noun
hypernym: 01019929-n