collation-n
type: LexicalEntry
canonical form: collation
sense: 01016549-n
part of speech: noun

01016549-n
type: LexicalConcept
in scheme: en-word.net
definition: assembling in proper numerical or logical sequence
ili: i40716
lexfile: noun.act
part of speech: noun
hypernym: 01016008-n