verify-v
type: LexicalEntry
canonical form: verify
sense: 01014404-v
part of speech: verb

01014404-v
type: LexicalConcept
in scheme: en-word.net
definition: attach or append a legal verification to (a pleading or petition)
ili: i26643
lexfile: verb.communication
part of speech: verb
domain topic: 08458195-n
hypernym: 01014100-v