organization-n
type: LexicalEntry
canonical form: organization
sense: 01010320-n
part of speech: noun

organisation-n
type: LexicalEntry
canonical form: organisation
sense: 01010320-n
part of speech: noun

01010320-n
type: LexicalConcept
in scheme: en-word.net
definition: the activity or result of distributing or disposing persons or things properly or methodically
example: his organization of the work force was very efficient
ili: i40685
lexfile: noun.act
part of speech: noun
hypernym: 00408356-n