reading-n
type: LexicalEntry
canonical form: reading
sense: 01006524-n
part of speech: noun

meter reading-n
type: LexicalEntry
canonical form: meter reading
sense: 01006524-n
part of speech: noun

01006524-n
type: LexicalConcept
in scheme: en-word.net
definition: the act of measuring with meters or similar instruments
example: he has a job meter reading for the gas company
ili: i40663
lexfile: noun.act
part of speech: noun
hypernym: 00998911-n