premise-v
type: LexicalEntry
canonical form: premise
sense: 01003512-v
part of speech: verb

01003512-v
type: LexicalConcept
in scheme: en-word.net
definition: set forth beforehand, often as an explanation
example: He premised these remarks so that his readers might understand
ili: i26591
lexfile: verb.communication
part of speech: verb
hypernym: 01003339-v