erase-v
type: LexicalEntry
canonical form: erase
sense: 01001860-v
part of speech: verb

delete-v
type: LexicalEntry
canonical form: delete
sense: 01001860-v
part of speech: verb

01001860-v
type: LexicalConcept
in scheme: en-word.net
definition: wipe out digitally or magnetically recorded information
example: Who erased the files from my hard disk?
ili: i26584
lexfile: verb.communication
part of speech: verb
domain topic: 00911901-n
hypernym: 00179456-v