proclaim-v
type: LexicalEntry
canonical form: proclaim
sense: 00980205-v
part of speech: verb

00980205-v
type: LexicalConcept
in scheme: en-word.net
definition: declare formally; declare someone to be something; of titles
example: He was proclaimed King
ili: i26481
lexfile: verb.communication
part of speech: verb
hypernym: 01031533-v