interrogate-v
type: LexicalEntry
canonical form: interrogate
sense: 00975562-v
part of speech: verb

00975562-v
type: LexicalConcept
in scheme: en-word.net
definition: transmit (a signal) for setting off an appropriate response, as in telecommunication
ili: i26458
lexfile: verb.communication
part of speech: verb
domain topic: 06274829-n
hypernym: 00975088-v