recuse-v
type: LexicalEntry
canonical form: recuse
sense: 00974899-v
part of speech: verb

00974899-v
type: LexicalConcept
in scheme: en-word.net
definition: disqualify oneself (as a judge) in a particular case
ili: i26456
lexfile: verb.communication
part of speech: verb
domain topic: 08458195-n
hypernym: 00974640-v