cool-a
type: LexicalEntry
canonical form: cool
sense: 00974839-s
part of speech: adjective

00974839-s
type: LexicalConcept
in scheme: en-word.net
definition: fashionable and attractive at the time; often skilled or socially adept
example: he's a cool dude
example: that's cool
example: Mary's dress is really cool
example: it's not cool to arrive at a party too early
ili: i5317
lexfile: adj.all
part of speech: adjective satellite
exemplifies: 07089193-n
similar: https://en-word.net/synset/00974254-a