call-v
type: LexicalEntry
canonical form: call
sense: 00973047-v
part of speech: verb

00973047-v
type: LexicalConcept
in scheme: en-word.net
definition: ascribe a quality to or give a name of a common noun that reflects a quality
example: He called me a bastard
example: She called her children lazy and ungrateful
ili: i26448
lexfile: verb.communication
part of speech: verb
hypernym: 01031885-v
similar: 00693282-v
similar: 01030757-v
similar: 01070017-v