campaign-n
type: LexicalEntry
canonical form: campaign
sense: 00970259-n
part of speech: noun

military campaign-n
type: LexicalEntry
canonical form: military campaign
sense: 00970259-n
part of speech: noun

00970259-n
type: LexicalConcept
in scheme: en-word.net
definition: several related operations aimed at achieving a particular goal (usually within geographical and temporal constraints)
ili: i40474
lexfile: noun.act
part of speech: noun
domain topic: 08215965-n
hypernym: 00957171-n