domestic violence-n
type: LexicalEntry
canonical form: domestic violence
sense: 00967829-n
part of speech: noun

00967829-n
type: LexicalConcept
in scheme: en-word.net
definition: violence or physical abuse directed toward your spouse or domestic partner or other members of a household
ili: i40460
lexfile: noun.act
part of speech: noun
hypernym: 00967515-n