lilt-v
type: LexicalEntry
canonical form: lilt
sense: 00952968-v
part of speech: verb

00952968-v
type: LexicalConcept
in scheme: en-word.net
definition: articulate in a very careful and rhythmic way
ili: i26353
lexfile: verb.communication
part of speech: verb
hypernym: 00980581-v