list-v
type: LexicalEntry
canonical form: list
sense: 00947885-v
part of speech: verb

name-v
type: LexicalEntry
canonical form: name
sense: 00947885-v
part of speech: verb

00947885-v
type: LexicalConcept
in scheme: en-word.net
definition: give or make a list of; name individually; give the names of
example: List the states west of the Mississippi
ili: i26331
lexfile: verb.communication
part of speech: verb
hypernym: 00948137-v