carving-n
type: LexicalEntry
canonical form: carving
sense: 00944050-n
part of speech: noun

cutting-n
type: LexicalEntry
canonical form: cutting
sense: 00944050-n
part of speech: noun

00944050-n
type: LexicalConcept
in scheme: en-word.net
definition: removing parts from hard material to create a desired pattern or shape
ili: i40356
lexfile: noun.act
part of speech: noun
hypernym: 00943593-n