imply-v
type: LexicalEntry
canonical form: imply
sense: 00932561-v
part of speech: verb

00932561-v
type: LexicalConcept
in scheme: en-word.net
definition: suggest as a logically necessary consequence; in logic
ili: i26263
lexfile: verb.communication
part of speech: verb
hypernym: 00945869-v