indicate-v
type: LexicalEntry
canonical form: indicate
sense: 00930203-v
part of speech: verb

00930203-v
type: LexicalConcept
in scheme: en-word.net
definition: suggest the necessity of an intervention; in medicine
example: Tetracycline is indicated in such cases
ili: i26251
lexfile: verb.communication
part of speech: verb
hypernym: 00833312-v