planning-n
type: LexicalEntry
canonical form: planning
sense: 00930186-n
part of speech: noun

00930186-n
type: LexicalConcept
in scheme: en-word.net
definition: the act or process of drawing up plans or layouts for some project or enterprise
ili: i40289
lexfile: noun.act
part of speech: noun
hypernym: 00929892-n