design-n
type: LexicalEntry
canonical form: design
sense: 00929892-n
part of speech: noun

designing-n
type: LexicalEntry
canonical form: designing
sense: 00929892-n
part of speech: noun

00929892-n
type: LexicalConcept
in scheme: en-word.net
definition: the act of working out the form of something (as by making a sketch or outline or plan)
example: he contributed to the design of a new instrument
ili: i40288
lexfile: noun.act
part of speech: noun
hypernym: 00929076-n