confection-n
type: LexicalEntry
canonical form: confection
sense: 00928483-n
part of speech: noun

concoction-n
type: LexicalEntry
canonical form: concoction
sense: 00928483-n
part of speech: noun

00928483-n
type: LexicalConcept
in scheme: en-word.net
definition: the act of creating something (a medicine or drink or soup etc.) by compounding or mixing a variety of components
ili: i40279
lexfile: noun.act
part of speech: noun
hypernym: 00910607-n