sericulture-n
type: LexicalEntry
canonical form: sericulture
sense: 00925117-n
part of speech: noun

00925117-n
type: LexicalConcept
in scheme: en-word.net
definition: the production of raw silk by raising silkworms
ili: i40262
lexfile: noun.act
part of speech: noun
hypernym: 00915536-n