breeding-n
type: LexicalEntry
canonical form: breeding
sense: 00916760-n
part of speech: noun

00916760-n
type: LexicalConcept
in scheme: en-word.net
definition: the production of animals or plants by inbreeding or hybridization
ili: i40215
lexfile: noun.act
part of speech: noun
hypernym: 00915536-n