whitewash-v
type: LexicalEntry
canonical form: whitewash
sense: 00906831-v
part of speech: verb

00906831-v
type: LexicalConcept
in scheme: en-word.net
definition: exonerate by means of a perfunctory investigation or through biased presentation of data
ili: i26140
lexfile: verb.communication
part of speech: verb
hypernym: 00905999-v