typification-n
type: LexicalEntry
canonical form: typification
sense: 00902279-n
part of speech: noun

00902279-n
type: LexicalConcept
in scheme: en-word.net
definition: the act of representing by a type or symbol; the action of typifying
ili: i40139
lexfile: noun.act
part of speech: noun
hypernym: 00900216-n