nod-v
type: LexicalEntry
canonical form: nod
sense: 00899973-v
part of speech: verb

00899973-v
type: LexicalConcept
in scheme: en-word.net
definition: lower and raise the head, as to indicate assent or agreement or confirmation
example: The teacher nodded when the student gave the right answer
ili: i26105
lexfile: verb.communication
part of speech: verb
hypernym: 00742582-v