doom-v
type: LexicalEntry
canonical form: doom
sense: 00892376-v
part of speech: verb

00892376-v
type: LexicalConcept
in scheme: en-word.net
definition: make certain of the failure or destruction of
example: This decision will doom me to lose my position
ili: i26073
lexfile: verb.communication
part of speech: verb
hypernym: 00892111-v