athletics-n
type: LexicalEntry
canonical form: athletics
sense: 00888260-n
part of speech: noun

00888260-n
type: LexicalConcept
in scheme: en-word.net
definition: participation in sports events as an extracurricular activity
ili: i40053
lexfile: noun.act
part of speech: noun
hypernym: 00887950-n