attenuated-a
type: LexicalEntry
canonical form: attenuated
sense: 00885554-s
part of speech: adjective

00885554-s
type: LexicalConcept
in scheme: en-word.net
definition: of an electrical signal; reduced in amplitude with little or no distortion
ili: i4838
lexfile: adj.all
part of speech: adjective satellite
domain topic: 06108876-n
similar: https://en-word.net/synset/00884977-a