commend-v
type: LexicalEntry
canonical form: commend
sense: 00884044-v
part of speech: verb

remember-v
type: LexicalEntry
canonical form: remember
sense: 00884044-v
part of speech: verb

00884044-v
type: LexicalConcept
in scheme: en-word.net
definition: mention as by way of greeting or to indicate friendship
example: Remember me to your wife
ili: i26032
lexfile: verb.communication
part of speech: verb
hypernym: 01026199-v