compliment-v
type: LexicalEntry
canonical form: compliment
sense: 00883182-v
part of speech: verb

congratulate-v
type: LexicalEntry
canonical form: congratulate
sense: 00883182-v
part of speech: verb

00883182-v
type: LexicalConcept
in scheme: en-word.net
definition: say something to someone that expresses praise
example: He complimented her on her last physics paper
ili: i26027
lexfile: verb.communication
part of speech: verb
hypernym: 00858506-v