advance-v
type: LexicalEntry
canonical form: advance
sense: 00877337-v
part of speech: verb

throw out-v
type: LexicalEntry
canonical form: throw out
sense: 00877337-v
part of speech: verb

00877337-v
type: LexicalConcept
in scheme: en-word.net
definition: bring forward for consideration or acceptance
example: advance an argument
ili: i25998
lexfile: verb.communication
part of speech: verb
hypernym: 00876925-v