summation-n
type: LexicalEntry
canonical form: summation
sense: 00873785-n
part of speech: noun

addition-n
type: LexicalEntry
canonical form: addition
sense: 00873785-n
part of speech: noun

00873785-n
type: LexicalConcept
in scheme: en-word.net
definition: the arithmetic operation of summing; calculating the sum of two or more numbers
example: the summation of four and three gives seven
ili: i39978
lexfile: noun.act
part of speech: noun
hypernym: 00874219-n